Target
Cysteinyl leukotriene receptor 1/2
Ligand
BDBM50227047
Substrate
Meas. Tech.
ChEMBL_75477 (CHEMBL687342)
IC50
0.370000±n/a nM
Citation
 Nakai, HKonno, MKosuge, SSakuyama, SToda, MArai, YObata, TKatsube, NMiyamoto, TOkegawa, T New potent antagonists of leukotrienes C4 and D4. 1. Synthesis and structure-activity relationships. J Med Chem 31:84-91 (1988)  
Target
Name:
Cysteinyl leukotriene receptor 1/2
Synonyms:
Cysteinyl leukotriene receptor
Type:
Mol. Mass.:
Description:
ASSAY_ID of ChEMBL is 98640
Components:
This complex has 2 components.
Component 1
Name:
Cysteinyl leukotriene receptor 1
Synonyms:
CLTR1_HUMAN CYSLTR1 Cysteinyl leukotriene receptor HG55 LTD4 receptor | Leukotriene Cysteinyl 1
Type:
Enzyme Catalytic Domain
Mol. Mass.:
38565.16
Organism:
Homo sapiens (Human)
Description:
Leukotriene Cysteinyl 1 CYSLTR1 HUMAN::Q9Y271
Residue:
337
  
Component 2
Name:
Cysteinyl leukotriene receptor 2
Synonyms:
CLTR2_HUMAN CYSLT2R Cysteinyl leukotriene receptor Leukotriene Cysteinyl 2
Type:
Enzyme Catalytic Domain
Mol. Mass.:
39657.52
Organism:
Homo sapiens (Human)
Description:
Leukotriene Cysteinyl 2 CYSLTR2 HUMAN::Q9NS75
Residue:
346
  
Inhibitor
Name:
BDBM50227047
Synonyms:
CHEMBL172889
Type:
Small organic molecule
Emp. Form.:
C26H25N5O4
Mol. Mass.:
471.5078
SMILES:
O=C(Nc1cccc2OCC(Oc12)c1nnn[nH]1)c1ccc(OCCCCc2ccccc2)cc1
: