Target
Dihydrofolate reductase
Ligand
BDBM50138698
Substrate
Meas. Tech.
ChEBML_54731
Ki
2512±n/a nM
Citation
 Li, RLPoe, M Quantitative structure-activity relationships for the inhibition of Escherichia coli dihydrofolate reductase by 5-(substituted benzyl)-2,4-diaminopyrimidines. J Med Chem 31:366-70 (1988)  
Target
Name:
Dihydrofolate reductase
Synonyms:
Dihydrofolate reductase (F31V) | dfrA17
Type:
Mol. Mass.:
17532.46
Organism:
Escherichia coli
Description:
Residue:
157
  
Inhibitor
Name:
BDBM50138698
Synonyms:
5-(4-Heptyloxy-benzyl)-pyrimidine-2,4-diamine | CHEMBL30937
Type:
Small organic molecule
Emp. Form.:
C18H26N4O
Mol. Mass.:
314.4252
SMILES:
CCCCCCCOc1ccc(Cc2cnc(N)nc2N)cc1
: