Target
Beta-1/Beta-2/Beta-3 adrenergic receptor
Ligand
BDBM50227815
Substrate
Meas. Tech.
ChEMBL_38884 (CHEMBL652715)
Ki
4.0±n/a nM
Citation
 Wu, ESCole, TEDavidson, TADailey, MADoring, KGFedorchuk, MLoch, JTThomas, TLBlosser, JCBorrelli, AR Flavones. 2. Synthesis and structure-activity relationship of flavodilol and its analogues, a novel class of antihypertensive agents with catecholamine depleting properties. J Med Chem 32:183-92 (1989)  
Target
Name:
Beta-1/Beta-2/Beta-3 adrenergic receptor
Synonyms:
Adrenergic receptor beta
Type:
Mol. Mass.:
Description:
ASSAY_ID of ChEMBL is 1340543
Components:
This complex has 3 components.
Component 1
Name:
Beta-1 adrenergic receptor
Synonyms:
ADRB1R, B1AR Adrb1 Adrenergic receptor beta Beta-1 adrenoreceptor adrenergic Beta1,2
Type:
Protein
Mol. Mass.:
50486.84
Organism:
Rattus norvegicus (Rat)
Description:
P18090
Residue:
466
  
Component 2
Name:
Beta-2 adrenergic receptor
Synonyms:
ADRB2_RAT Adrb2r | Adrenergic receptor beta
Type:
PROTEIN
Mol. Mass.:
46896.26
Organism:
Rattus norvegicus
Description:
ChEMBL_38603
Residue:
418
  
Component 3
Name:
Beta-3 adrenergic receptor
Synonyms:
ADRB3_RAT Adrb3r Beta-3 adrenergic receptor
Type:
PROTEIN
Mol. Mass.:
43161.83
Organism:
Rattus norvegicus
Description:
ChEMBL_1509452
Residue:
400
  
Inhibitor
Name:
BDBM50227815
Synonyms:
Flavodilol
Type:
Small organic molecule
Emp. Form.:
C21H23NO4
Mol. Mass.:
353.4116
SMILES:
CCCNCC(O)COc1ccc2c(c1)oc(cc2=O)-c1ccccc1
: