Target
Phosphatidylinositol 4-kinase type 2-alpha
Ligand
BDBM50228481
Substrate
Meas. Tech.
ChEMBL_152904 (CHEMBL758627)
IC50
10200±n/a nM
Citation
 Young, RCJones, MMilliner, KJRana, KKWard, JG Purine derivatives as competitive inhibitors of human erythrocyte membrane phosphatidylinositol 4-kinase. J Med Chem 33:2073-80 (1990)  
Target
Name:
Phosphatidylinositol 4-kinase type 2-alpha
Synonyms:
P4K2A_HUMAN Phosphatidylinositol 4-kinase type 2-alpha | Phosphatidylinositol 4-kinase type II-alpha
Type:
PROTEIN
Mol. Mass.:
54030.26
Organism:
Homo sapiens (Human)
Description:
ChEMBL_104812
Residue:
479
  
Inhibitor
Name:
BDBM50228481
Synonyms:
CHEMBL306444
Type:
Small organic molecule
Emp. Form.:
C9H13N5
Mol. Mass.:
191.233
SMILES:
CC(C)(C)n1cnc2c(N)ncnc12
: