Target
cAMP-specific 3',5'-cyclic phosphodiesterase 4C
Ligand
BDBM50228868
Substrate
Meas. Tech.
ChEMBL_42939 (CHEMBL654581)
IC50
6500±n/a nM
Citation
 Vinick, FJSaccomano, NAKoe, BKNielsen, JAWilliams, IHThadeio, PFJung, SMeltz, MJohnson, JLebel, LA Nicotinamide ethers: novel inhibitors of calcium-independent phosphodiesterase and [3H]rolipram binding. J Med Chem 34:86-9 (1991)  
Target
Name:
cAMP-specific 3',5'-cyclic phosphodiesterase 4C
Synonyms:
Dpde1 Pde4c
Type:
PROTEIN
Mol. Mass.:
60038.21
Organism:
Rattus norvegicus
Description:
ChEMBL_104732
Residue:
536
  
Inhibitor
Name:
BDBM50228868
Synonyms:
CHEMBL168121
Type:
Small organic molecule
Emp. Form.:
C20H15F3N2O2
Mol. Mass.:
372.3405
SMILES:
FC(F)(F)c1cccc(Oc2ncccc2C(=O)NCc2ccccc2)c1
: