Target
Gastrin/cholecystokinin type B receptor
Ligand
BDBM50230677
Substrate
Meas. Tech.
ChEMBL_48424 (CHEMBL660352)
Ki
0.512861±n/a nM
Citation
 Higginbottom, MKneen, CRatcliffe, GS Rationally designed"dipeptoid" analogues of CCK. A Free-Wilson/Fujita-Ban analysis of some alpha-methyltryptophan derivatives as CCK-B antagonists. J Med Chem 35:1572-7 (1992)  
Target
Name:
Gastrin/cholecystokinin type B receptor
Synonyms:
Cckbr Cholecystokinin receptor Gastrin/cholecystokinin type B receptor
Type:
Enzyme Catalytic Domain
Mol. Mass.:
49196.59
Organism:
MOUSE
Description:
Cholecystokinin A CCKBR MOUSE::P56481
Residue:
453
  
Inhibitor
Name:
BDBM50230677
Synonyms:
CHEMBL3351022
Type:
Small organic molecule
Emp. Form.:
C35H40N4O6
Mol. Mass.:
612.7153
SMILES:
C[C@](Cc1c[nH]c2ccccc12)(NC(=O)OC1C2CC3CC(C2)CC1C3)C(=O)NC[C@H](NC(=O)\C=C\C(O)=O)c1ccccc1
: