Target
Carbonic anhydrase 2
Ligand
BDBM50003677
Substrate
Meas. Tech.
ChEMBL_1643898 (CHEMBL3992827)
Ki
>50000±n/a nM
Citation
 van Kuijk, SJAParvathaneni, NKNiemans, Rvan Gisbergen, MWCarta, FVullo, DPastorekova, SYaromina, ASupuran, CTDubois, LJWinum, JYLambin, P New approach of delivering cytotoxic drugs towards CAIX expressing cells: A concept of dual-target drugs. Eur J Med Chem 127:691-702 (2017)  
Target
Name:
Carbonic anhydrase 2
Synonyms:
CA-II CAC Carbonate dehydratase II Carbonic anhydrase 2 (CA-II) Carbonic anhydrase C Carbonic anhydrase II (CA-II) Carbonic anhydrase II (hCA II) | Carbonic anhydrase isoenzyme II (hCA II)
Type:
Enzyme
Mol. Mass.:
29250.71
Organism:
Homo sapiens (Human)
Description:
P00918
Residue:
260
  
Inhibitor
Name:
BDBM50003677
Synonyms:
4-(p-bis(beta-chloroethyl)aminophenyl)butyric acid 4-{4-[bis(2-chloroethyl)amino]phenyl}butanoic acid CHEMBL515 Leukeran chloraminophen phenylbutyric acid nitrogen mustard
Type:
Small organic molecule
Emp. Form.:
C14H19Cl2NO2
Mol. Mass.:
304.212
SMILES:
OC(=O)CCCc1ccc(cc1)N(CCCl)CCCl
: