Target
Carbonic anhydrase 12
Ligand
BDBM50003677
Substrate
Meas. Tech.
ChEMBL_1643900 (CHEMBL3992829)
Ki
>50000±n/a nM
Citation
 van Kuijk, SJAParvathaneni, NKNiemans, Rvan Gisbergen, MWCarta, FVullo, DPastorekova, SYaromina, ASupuran, CTDubois, LJWinum, JYLambin, P New approach of delivering cytotoxic drugs towards CAIX expressing cells: A concept of dual-target drugs. Eur J Med Chem 127:691-702 (2017)  
Target
Name:
Carbonic anhydrase 12
Synonyms:
CA-XII CAH12_HUMAN Carbonic anhydrase Carbonic anhydrase XII Carbonic anhydrase XII (CAXII) | Tumor antigen HOM-RCC-3.1.3
Type:
Enzyme
Mol. Mass.:
39456.00
Organism:
Homo sapiens (Human)
Description:
Catalytic domain of human cloned isozyme was used in the assay
Residue:
354
  
Inhibitor
Name:
BDBM50003677
Synonyms:
4-(p-bis(beta-chloroethyl)aminophenyl)butyric acid 4-{4-[bis(2-chloroethyl)amino]phenyl}butanoic acid CHEMBL515 Leukeran chloraminophen phenylbutyric acid nitrogen mustard
Type:
Small organic molecule
Emp. Form.:
C14H19Cl2NO2
Mol. Mass.:
304.212
SMILES:
OC(=O)CCCc1ccc(cc1)N(CCCl)CCCl
: