Target
Receptor-interacting serine/threonine-protein kinase 1
Ligand
BDBM50229025
Substrate
Meas. Tech.
ChEBML_1644191
EC50
27±n/a nM
Citation
 Ren, YSu, YSun, LHe, SMeng, LLiao, DLiu, XMa, YLiu, CLi, SRuan, HLei, XWang, XZhang, Z Discovery of a Highly Potent, Selective, and Metabolically Stable Inhibitor of Receptor-Interacting Protein 1 (RIP1) for the Treatment of Systemic Inflammatory Response Syndrome. J Med Chem 60:972-986 (2017)  
Target
Name:
Receptor-interacting serine/threonine-protein kinase 1
Synonyms:
Cell death protein RIP RIPK1_MOUSE Receptor-interacting serine/threonine-protein kinase 1 Rinp Ripk1 | Serine/threonine-protein kinase RIP
Type:
PROTEIN
Mol. Mass.:
74852.62
Organism:
Mus musculus
Description:
ChEMBL_116773
Residue:
656
  
Inhibitor
Name:
BDBM50229025
Synonyms:
CHEMBL4092421
Type:
Small organic molecule
Emp. Form.:
C13H19NO2
Mol. Mass.:
221.2955
SMILES:
CCC(C)(C)C(=O)N(O)Cc1ccccc1
: