Target
Cytochrome P450 3A4
Ligand
BDBM50229025
Substrate
Meas. Tech.
ChEBML_1644225
IC50
>3500±n/a nM
Citation
 Ren, YSu, YSun, LHe, SMeng, LLiao, DLiu, XMa, YLiu, CLi, SRuan, HLei, XWang, XZhang, Z Discovery of a Highly Potent, Selective, and Metabolically Stable Inhibitor of Receptor-Interacting Protein 1 (RIP1) for the Treatment of Systemic Inflammatory Response Syndrome. J Med Chem 60:972-986 (2017)  
Target
Name:
Cytochrome P450 3A4
Synonyms:
Albendazole monooxygenase CP3A4_HUMAN CYP3A4 CYPIIIA4 Cytochrome P450 3A4 (CYP3A4) Nifedipine oxidase Taurochenodeoxycholate 6-alpha-hydroxylase
Type:
Enzyme
Mol. Mass.:
57349.57
Organism:
Homo sapiens (Human)
Description:
Residue:
503
  
Inhibitor
Name:
BDBM50229025
Synonyms:
CHEMBL4092421
Type:
Small organic molecule
Emp. Form.:
C13H19NO2
Mol. Mass.:
221.2955
SMILES:
CCC(C)(C)C(=O)N(O)Cc1ccccc1
: