Target
Vascular endothelial growth factor receptor 2
Ligand
BDBM5417
Substrate
Meas. Tech.
ChEMBL_1646127 (CHEMBL3995183)
IC50
224±n/a nM
Citation
 Cherukupalli, SKarpoormath, RChandrasekaran, BHampannavar, GAThapliyal, NPalakollu, VN An insight on synthetic and medicinal aspects of pyrazolo[1,5-a]pyrimidine scaffold. Eur J Med Chem 126:298-352 (2017)  
Target
Name:
Vascular endothelial growth factor receptor 2
Synonyms:
CD_antigen=CD309 Fetal liver kinase 1 (FLK-1) KDR Protein-tyrosine kinase receptor Flk-1 VEGFR-2 VEGFR2 Vascular Endothelial Growth Factor Receptor Kinase 2 Vascular endothelial growth factor receptor 2 (KDR) Vascular endothelial growth factor receptor 2 (VEGFR2) Vascular endothelial growth factor receptor-2 (VEGFR-2)
Type:
Receptor Tyrosine Kinase
Mol. Mass.:
151510.97
Organism:
Homo sapiens (Human)
Description:
P35968
Residue:
1356
  
Inhibitor
Name:
BDBM5417
Synonyms:
4-[6-(pyridin-4-yl)pyrazolo[1,5-a]pyrimidin-3-yl]pyridine | pyrazolo[1,5-a]pyrimidine 1a
Type:
Small organic molecule
Emp. Form.:
C16H11N5
Mol. Mass.:
273.292
SMILES:
c1nn2cc(cnc2c1-c1ccncc1)-c1ccncc1
: