Target
Translocator protein
Ligand
BDBM50232191
Substrate
Meas. Tech.
ChEMBL_1646138 (CHEMBL3995194)
Ki
2.5±n/a nM
Citation
 Cherukupalli, SKarpoormath, RChandrasekaran, BHampannavar, GAThapliyal, NPalakollu, VN An insight on synthetic and medicinal aspects of pyrazolo[1,5-a]pyrimidine scaffold. Eur J Med Chem 126:298-352 (2017)  
Target
Name:
Translocator protein
Synonyms:
Benzodiazepine receptors; peripheral & central Mbr PBR Peripheral benzodiazepine receptor (PBR) TSPO_RAT | Tspo
Type:
Mitochondrion membrane protein
Mol. Mass.:
18945.84
Organism:
Rattus norvegicus (rat)
Description:
Competitive binding experiments were performed on rat kidney mitochondrial membranes.
Residue:
169
  
Inhibitor
Name:
BDBM50232191
Synonyms:
CHEMBL4089611
Type:
Small organic molecule
Emp. Form.:
C26H26ClN3O
Mol. Mass.:
431.957
SMILES:
CCC(CC)C(=O)Cc1c(nn2c(cc(C)nc12)-c1ccccc1)-c1ccc(Cl)cc1
: