Target
Protein mono-ADP-ribosyltransferase PARP3
Ligand
BDBM50446130
Substrate
Meas. Tech.
ChEBML_1646306
IC50
407±n/a nM
Citation
 Thorsell, AGEkblad, TKarlberg, TLöw, MPinto, AFTrésaugues, LMoche, MCohen, MSSchüler, H Structural Basis for Potency and Promiscuity in Poly(ADP-ribose) Polymerase (PARP) and Tankyrase Inhibitors. J Med Chem 60:1262-1271 (2017)  
Target
Name:
Protein mono-ADP-ribosyltransferase PARP3
Synonyms:
ADP-ribosyltransferase diphtheria toxin-like 3 ADPRT3 ARTD3 NAD(+) ADP-ribosyltransferase 3 PARP3 Poly [ADP-ribose] polymerase 3 hPARP-3 | pADPRT-3
Type:
PROTEIN
Mol. Mass.:
60091.40
Organism:
Homo sapiens (Human)
Description:
ChEMBL_109545
Residue:
533
  
Inhibitor
Name:
BDBM50446130
Synonyms:
AG-014699 RUCAPARIB CAMSYLATE | Rucaparib
Type:
Small organic molecule
Emp. Form.:
C19H18FN3O
Mol. Mass.:
323.3641
SMILES:
CNCc1ccc(cc1)-c1[nH]c2cc(F)cc3C(=O)NCCc1c23
: