Target
Carbonic anhydrase 2
Ligand
BDBM26986
Substrate
Meas. Tech.
ChEMBL_1648444 (CHEMBL3997500)
Ki
85000000±n/a nM
Citation
 Del Prete, SVullo, Ddi Fonzo, PCarginale, VSupuran, CTCapasso, C Comparison of the anion inhibition profiles of theß- and¿-carbonic anhydrases from the pathogenic bacterium Burkholderia pseudomallei. Bioorg Med Chem 25:2010-2015 (2017)  
Target
Name:
Carbonic anhydrase 2
Synonyms:
CA-II CAC Carbonate dehydratase II Carbonic anhydrase 2 (CA-II) Carbonic anhydrase C Carbonic anhydrase II (CA-II) Carbonic anhydrase II (hCA II) | Carbonic anhydrase isoenzyme II (hCA II)
Type:
Enzyme
Mol. Mass.:
29250.71
Organism:
Homo sapiens (Human)
Description:
P00918
Residue:
260
  
Inhibitor
Name:
BDBM26986
Synonyms:
CHEMBL363707 SODIUM BICARBONATE hydrogen carbonate
Type:
Ion
Emp. Form.:
CHO3
Mol. Mass.:
61.0174
SMILES:
OC([O-])=O
: