Target
Sigma intracellular receptor 2
Ligand
BDBM50232742
Substrate
Meas. Tech.
ChEMBL_1648505 (CHEMBL3997561)
Ki
24±n/a nM
Citation
 Sahn, JJHodges, TRChan, JZMartin, SF Norbenzomorphan Scaffold: Chemical Tool for Modulating Sigma Receptor-Subtype Selectivity. ACS Med Chem Lett 8:455-460 (2017)  
Target
Name:
Sigma intracellular receptor 2
Synonyms:
S2r Sigma intracellular receptor 2 Sigma2 receptor Transmembrane protein 97
Type:
Protein
Mol. Mass.:
20953.88
Organism:
Rattus norvegicus (Rat)
Description:
Q5U3Y7
Residue:
176
  
Inhibitor
Name:
BDBM50232742
Synonyms:
CHEMBL4065699 | US11046670, Table 6.4
Type:
Small organic molecule
Emp. Form.:
C28H35N3O4
Mol. Mass.:
477.5952
SMILES:
[H][C@]12C[C@@]([H])(N(CC1)C(=O)OCc1ccccc1)c1cc(ccc21)N1CCN(CCC(=O)OCC)CC1
: