Target
D-3-phosphoglycerate dehydrogenase
Ligand
BDBM50232873
Substrate
Meas. Tech.
ChEMBL_1649350 (CHEMBL3998484)
Kd
5800000±n/a nM
Citation
 Ravez, SSpillier, QMarteau, RFeron, OFrédérick, R Challenges and Opportunities in the Development of Serine Synthetic Pathway Inhibitors for Cancer Therapy. J Med Chem 60:1227-1237 (2017)  
Target
Name:
D-3-phosphoglycerate dehydrogenase
Synonyms:
D-3-phosphoglycerate dehydrogenase PHGDH SERA_HUMAN
Type:
Protein
Mol. Mass.:
56650.89
Organism:
Homo sapiens (Human)
Description:
Residue:
533
  
Inhibitor
Name:
BDBM50232873
Synonyms:
CHEMBL4084029
Type:
Small organic molecule
Emp. Form.:
C10H11N3
Mol. Mass.:
173.2144
SMILES:
Cn1nc(cc1N)-c1ccccc1
: