Target
Cytochrome P450 2D6
Ligand
BDBM50233637
Substrate
Meas. Tech.
ChEMBL_1651047 (CHEMBL4000302)
IC50
>20000±n/a nM
Citation
 Duraiswamy, AJLee, MAMadan, BAng, SHTan, ESCheong, WWKe, ZPendharkar, VDing, LJChew, YSManoharan, VSangthongpitag, KAlam, JPoulsen, AHo, SYVirshup, DMKeller, TH Discovery and Optimization of a Porcupine Inhibitor. J Med Chem 58:5889-99 (2015)  
Target
Name:
Cytochrome P450 2D6
Synonyms:
CP2D6_HUMAN CYP2DL1 Cytochrome P450 2D6 (CYP2D6) P450-DB1
Type:
Protein
Mol. Mass.:
55774.82
Organism:
Homo sapiens (Human)
Description:
P10635
Residue:
497
  
Inhibitor
Name:
BDBM50233637
Synonyms:
CHEMBL4063419
Type:
Small organic molecule
Emp. Form.:
C23H18N2O3
Mol. Mass.:
370.4006
SMILES:
O=C(COc1ccc(cc1)-c1cnco1)Nc1ccc(cc1)-c1ccccc1
: