Target
Cytochrome P450 2D6
Ligand
BDBM50233629
Substrate
Meas. Tech.
ChEMBL_1651047 (CHEMBL4000302)
IC50
>20000±n/a nM
Citation
 Duraiswamy, AJLee, MAMadan, BAng, SHTan, ESCheong, WWKe, ZPendharkar, VDing, LJChew, YSManoharan, VSangthongpitag, KAlam, JPoulsen, AHo, SYVirshup, DMKeller, TH Discovery and Optimization of a Porcupine Inhibitor. J Med Chem 58:5889-99 (2015)  
Target
Name:
Cytochrome P450 2D6
Synonyms:
CP2D6_HUMAN CYP2DL1 Cytochrome P450 2D6 (CYP2D6) P450-DB1
Type:
Protein
Mol. Mass.:
55774.82
Organism:
Homo sapiens (Human)
Description:
P10635
Residue:
497
  
Inhibitor
Name:
BDBM50233629
Synonyms:
CHEMBL4080842
Type:
Small organic molecule
Emp. Form.:
C23H22N6O
Mol. Mass.:
398.4604
SMILES:
C[C@H](Nc1ccc(nc1)-c1ccnn1C)C(=O)Nc1ccc(cn1)-c1ccccc1
: