Target
Cytochrome P450 2D6
Ligand
BDBM50233636
Substrate
Meas. Tech.
ChEMBL_1651047 (CHEMBL4000302)
IC50
1900±n/a nM
Citation
 Duraiswamy, AJLee, MAMadan, BAng, SHTan, ESCheong, WWKe, ZPendharkar, VDing, LJChew, YSManoharan, VSangthongpitag, KAlam, JPoulsen, AHo, SYVirshup, DMKeller, TH Discovery and Optimization of a Porcupine Inhibitor. J Med Chem 58:5889-99 (2015)  
Target
Name:
Cytochrome P450 2D6
Synonyms:
CP2D6_HUMAN CYP2DL1 Cytochrome P450 2D6 (CYP2D6) P450-DB1
Type:
Protein
Mol. Mass.:
55774.82
Organism:
Homo sapiens (Human)
Description:
P10635
Residue:
497
  
Inhibitor
Name:
BDBM50233636
Synonyms:
CHEMBL4070649
Type:
Small organic molecule
Emp. Form.:
C24H21N3O2
Mol. Mass.:
383.4424
SMILES:
Cc1nccn1-c1ccc(OCC(=O)Nc2ccc(cc2)-c2ccccc2)cc1
: