Target
ATP-citrate synthase
Ligand
BDBM50234007
Substrate
Meas. Tech.
ChEMBL_1651959 (CHEMBL4001214)
IC50
21200±n/a nM
Citation
 Koerner, SKHanai, JIBai, SJernigan, FEOki, MKomaba, CShuto, ESukhatme, VPSun, L Design and synthesis of emodin derivatives as novel inhibitors of ATP-citrate lyase. Eur J Med Chem 126:920-928 (2017)  
Target
Name:
ATP-citrate synthase
Synonyms:
ACLY | ACLY_HUMAN
Type:
PROTEIN
Mol. Mass.:
120848.43
Organism:
Homo sapiens (Human)
Description:
ChEMBL_455196
Residue:
1101
  
Inhibitor
Name:
BDBM50234007
Synonyms:
CHEMBL4103478
Type:
Small organic molecule
Emp. Form.:
C22H16O6
Mol. Mass.:
376.3588
SMILES:
COc1cccc(c1)-c1c(O)cc2C(=O)c3cc(C)cc(O)c3C(=O)c2c1O
: