Target
ATP-citrate synthase
Ligand
BDBM50394674
Substrate
Meas. Tech.
ChEMBL_1651960 (CHEMBL4001215)
IC50
283±n/a nM
Citation
 Koerner, SKHanai, JIBai, SJernigan, FEOki, MKomaba, CShuto, ESukhatme, VPSun, L Design and synthesis of emodin derivatives as novel inhibitors of ATP-citrate lyase. Eur J Med Chem 126:920-928 (2017)  
Target
Name:
ATP-citrate synthase
Synonyms:
ACLY_RAT | Acly
Type:
PROTEIN
Mol. Mass.:
120645.65
Organism:
Rattus norvegicus
Description:
ChEMBL_857791
Residue:
1100
  
Inhibitor
Name:
BDBM50394674
Synonyms:
CHEMBL2165254
Type:
Small organic molecule
Emp. Form.:
C15H11ClO4
Mol. Mass.:
290.698
SMILES:
Cc1cc(O)c2C(=O)c3c(O)c(Cl)c(O)cc3Cc2c1
: