Target
Platelet-derived growth factor receptor alpha
Ligand
BDBM50234074
Substrate
Meas. Tech.
ChEMBL_1652016 (CHEMBL4001271)
IC50
<10000±n/a nM
Citation
 Cheeseman, MDChessum, NERye, CSPasqua, AETucker, MJWilding, BEvans, LELepri, SRichards, MSharp, SYAli, SRowlands, MO'Fee, LMiah, AHayes, AHenley, ATPowers, MTe Poele, RDe Billy, EPellegrino, LRaynaud, FBurke, Rvan Montfort, RLEccles, SAWorkman, PJones, K Discovery of a Chemical Probe Bisamide (CCT251236): An Orally Bioavailable Efficacious Pirin Ligand from a Heat Shock Transcription Factor 1 (HSF1) Phenotypic Screen. J Med Chem 60:180-201 (2017)  
Target
Name:
Platelet-derived growth factor receptor alpha
Synonyms:
Alpha-type platelet-derived growth factor receptor PDGFRA PGFRA_HUMAN Platelet-derived growth factor receptor alpha (PDGFRA) RHEPDGFRA
Type:
Protein
Mol. Mass.:
122633.38
Organism:
Homo sapiens (Human)
Description:
P16234
Residue:
1089
  
Inhibitor
Name:
BDBM50234074
Synonyms:
CHEMBL4070633 | US9701664, Example 39
Type:
Small organic molecule
Emp. Form.:
C27H23N3O4
Mol. Mass.:
453.4892
SMILES:
Cc1ccc2cc(ccc2n1)C(=O)Nc1cc(NC(=O)c2ccc3OCCOc3c2)ccc1C
: