Target
Tyrosine-protein kinase JAK3
Ligand
BDBM50234898
Substrate
Meas. Tech.
ChEMBL_1654086 (CHEMBL4003452)
IC50
139±n/a nM
Citation
 Jones, PStorer, RISabnis, YAWakenhut, FMWhitlock, GAEngland, KSMukaiyama, TDehnhardt, CMCoe, JWKortum, SWChrencik, JEBrown, DGJones, RMMurphy, JRYeoh, TMorgan, PKilty, I Design and Synthesis of a Pan-Janus Kinase Inhibitor Clinical Candidate (PF-06263276) Suitable for Inhaled and Topical Delivery for the Treatment of Inflammatory Diseases of the Lungs and Skin. J Med Chem 60:767-786 (2017)  
Target
Name:
Tyrosine-protein kinase JAK3
Synonyms:
JAK-3 JAK3_HUMAN Janus kinase 3 (JAK3) L-JAK | Leukocyte janus kinase
Type:
Protein
Mol. Mass.:
125111.08
Organism:
Homo sapiens (Human)
Description:
P52333
Residue:
1124
  
Inhibitor
Name:
BDBM50234898
Synonyms:
CHEMBL4068357 | D3RKN_91
Type:
Small organic molecule
Emp. Form.:
C18H26N6O
Mol. Mass.:
342.4386
SMILES:
C[C@@H]1CCN(C[C@@H]1N(C)c1ncnc2[nH]ccc12)C(=O)N1CCCC1
: