Target
Histone acetyltransferase KAT2B
Ligand
BDBM50234944
Substrate
Meas. Tech.
ChEMBL_1654185 (CHEMBL4003551)
IC50
501±n/a nM
Citation
 Humphreys, PGBamborough, PChung, CWCraggs, PDGordon, LGrandi, PHayhow, TGHussain, JJones, KLLindon, MMichon, AMRenaux, JFSuckling, CJTough, DFPrinjha, RK Discovery of a Potent, Cell Penetrant, and Selective p300/CBP-Associated Factor (PCAF)/General Control Nonderepressible 5 (GCN5) Bromodomain Chemical Probe. J Med Chem 60:695-709 (2017)  
Target
Name:
Histone acetyltransferase KAT2B
Synonyms:
Histone acetyltransferase KAT2A/KAT2B KAT2B PCAF
Type:
PROTEIN
Mol. Mass.:
93045.76
Organism:
Homo sapiens (Human)
Description:
ChEMBL_1502838
Residue:
832
  
Inhibitor
Name:
BDBM50234944
Synonyms:
CHEMBL4072538 | US10239861, Example 60
Type:
Small organic molecule
Emp. Form.:
C11H17ClN4O
Mol. Mass.:
256.732
SMILES:
CN1CCC[C@H](C1)Nc1cnn(C)c(=O)c1Cl
: