Target
Adenosine receptor A3
Ligand
BDBM50011294
Substrate
Meas. Tech.
ChEMBL_1654446 (CHEMBL4003812)
Ki
5000±n/a nM
Citation
 Basu, SBarawkar, DAThorat, SShejul, YDPatel, MNaykodi, MJain, VSalve, YPrasad, VChaudhary, SGhosh, IBhat, GQuraishi, APatil, HAnsari, SMenon, SUnadkat, VThakare, RSeervi, MSMeru, AVDe, SBhamidipati, RKRouduri, SRPalle, VPChug, AMookhtiar, KA Design, Synthesis of Novel, Potent, Selective, Orally Bioavailable Adenosine A J Med Chem 60:681-694 (2017)  
Target
Name:
Adenosine receptor A3
Synonyms:
A3 adenosine receptor (hA3) ADORA3 | Adenosine A3 receptor (A3AR)
Type:
G Protein-Coupled Receptor (GPCR)
Mol. Mass.:
36197.32
Organism:
Homo sapiens (Human)
Description:
P0DMS8
Residue:
318
  
Inhibitor
Name:
BDBM50011294
Synonyms:
A2A Ro-4494351-002 SYN-115 | TOZADENANT
Type:
Small organic molecule
Emp. Form.:
C19H26N4O4S
Mol. Mass.:
406.499
SMILES:
COc1ccc(N2CCOCC2)c2sc(NC(=O)N3CCC(C)(O)CC3)nc12
: