Target
Polyunsaturated fatty acid lipoxygenase ALOX15B
Ligand
BDBM50235696
Substrate
Meas. Tech.
ChEMBL_1657726 (CHEMBL4007196)
IC50
120±n/a nM
Citation
 Zaware, NKisliuk, RBastian, AIhnat, MAGangjee, A Synthesis and evaluation of 5-(arylthio)-9H-pyrimido[4,5-b]indole-2,4-diamines as receptor tyrosine kinase and thymidylate synthase inhibitors and as antitumor agents. Bioorg Med Chem Lett 27:1602-1607 (2017)  
Target
Name:
Polyunsaturated fatty acid lipoxygenase ALOX15B
Synonyms:
Alox15b LX15B_RAT
Type:
PROTEIN
Mol. Mass.:
76140.88
Organism:
Rattus norvegicus
Description:
ChEMBL_12426
Residue:
677
  
Inhibitor
Name:
BDBM50235696
Synonyms:
CHEMBL4060383
Type:
Small organic molecule
Emp. Form.:
C20H15N5S
Mol. Mass.:
357.432
SMILES:
Nc1nc(N)c2c(n1)[nH]c1cccc(Sc3ccc4ccccc4c3)c21
: