Target
Cholinesterase
Ligand
BDBM50235800
Substrate
Meas. Tech.
ChEMBL_1657927 (CHEMBL4007539)
IC50
119±n/a nM
Citation
 Wu, JTian, YWang, SPistolozzi, MJin, YZhou, TRoy, GXu, LTan, W Design, synthesis and biological evaluation of bambuterol analogues as novel inhibitors of butyrylcholinesterase. Eur J Med Chem 126:61-71 (2017)  
Target
Name:
Cholinesterase
Synonyms:
BCHE CHLE_HORSE | Cholinesterase
Type:
Enzyme
Mol. Mass.:
65643.35
Organism:
Equus caballus (Horse)
Description:
P81908
Residue:
574
  
Inhibitor
Name:
BDBM50235800
Synonyms:
Bambuterol | CHEBI:553827
Type:
Small organic molecule
Emp. Form.:
C18H29N3O5
Mol. Mass.:
367.44
SMILES:
CN(C)C(=O)Oc1cc(OC(=O)N(C)C)cc(c1)C(O)CNC(C)(C)C
: