Target
Mineralocorticoid receptor
Ligand
BDBM121413
Substrate
Meas. Tech.
ChEMBL_1658415 (CHEMBL4008027)
IC50
9.4±n/a nM
Citation
 Martín-Martínez, MPérez-Gordillo, FLÁlvarez de la Rosa, DRodríguez, YGerona-Navarro, GGonzález-Muñiz, RZhou, MM Modulating Mineralocorticoid Receptor with Non-steroidal Antagonists. New Opportunities for the Development of Potent and Selective Ligands without Off-Target Side Effects. J Med Chem 60:2629-2650 (2017)  
Target
Name:
Mineralocorticoid receptor
Synonyms:
MCR MLR NR3C2 | Nuclear receptor subfamily 3 group C member 2
Type:
Enzyme
Mol. Mass.:
107076.42
Organism:
Homo sapiens (Human)
Description:
P08235
Residue:
984
  
Inhibitor
Name:
BDBM121413
Synonyms:
US8722709, 16
Type:
Small organic molecule
Emp. Form.:
C15H12ClN5O
Mol. Mass.:
313.742
SMILES:
NC(=O)Nc1cc(ccn1)-c1ccnn1-c1ccc(Cl)cc1
: