Target
Mineralocorticoid receptor
Ligand
BDBM121444
Substrate
Meas. Tech.
ChEMBL_1658416 (CHEMBL4008028)
IC50
31±n/a nM
Citation
 Martín-Martínez, MPérez-Gordillo, FLÁlvarez de la Rosa, DRodríguez, YGerona-Navarro, GGonzález-Muñiz, RZhou, MM Modulating Mineralocorticoid Receptor with Non-steroidal Antagonists. New Opportunities for the Development of Potent and Selective Ligands without Off-Target Side Effects. J Med Chem 60:2629-2650 (2017)  
Target
Name:
Mineralocorticoid receptor
Synonyms:
MCR MLR NR3C2 | Nuclear receptor subfamily 3 group C member 2
Type:
Enzyme
Mol. Mass.:
107076.42
Organism:
Homo sapiens (Human)
Description:
P08235
Residue:
984
  
Inhibitor
Name:
BDBM121444
Synonyms:
US8722709, 48
Type:
Small organic molecule
Emp. Form.:
C15H16FN3O
Mol. Mass.:
273.3054
SMILES:
Cc1cc(F)ccc1CCc1ccnc(NC(N)=O)c1
: