Target
Mineralocorticoid receptor
Ligand
BDBM50398064
Substrate
Meas. Tech.
ChEMBL_1658411 (CHEMBL4008023)
IC50
18±n/a nM
Citation
 Martín-Martínez, MPérez-Gordillo, FLÁlvarez de la Rosa, DRodríguez, YGerona-Navarro, GGonzález-Muñiz, RZhou, MM Modulating Mineralocorticoid Receptor with Non-steroidal Antagonists. New Opportunities for the Development of Potent and Selective Ligands without Off-Target Side Effects. J Med Chem 60:2629-2650 (2017)  
Target
Name:
Mineralocorticoid receptor
Synonyms:
MCR MLR NR3C2 | Nuclear receptor subfamily 3 group C member 2
Type:
Enzyme
Mol. Mass.:
107076.42
Organism:
Homo sapiens (Human)
Description:
P08235
Residue:
984
  
Inhibitor
Name:
BDBM50398064
Synonyms:
CHEMBL2181927
Type:
Small organic molecule
Emp. Form.:
C21H22N4O3
Mol. Mass.:
378.4244
SMILES:
CCOc1ncc(C)c2N=C(C)C([C@@H](c3ccc(cc3OC)C#N)c12)C(N)=O
: