Target
Mineralocorticoid receptor
Ligand
BDBM50398059
Substrate
Meas. Tech.
ChEMBL_1658407 (CHEMBL4008019)
IC50
9.4±n/a nM
Citation
 Martín-Martínez, MPérez-Gordillo, FLÁlvarez de la Rosa, DRodríguez, YGerona-Navarro, GGonzález-Muñiz, RZhou, MM Modulating Mineralocorticoid Receptor with Non-steroidal Antagonists. New Opportunities for the Development of Potent and Selective Ligands without Off-Target Side Effects. J Med Chem 60:2629-2650 (2017)  
Target
Name:
Mineralocorticoid receptor
Synonyms:
MCR MLR NR3C2 | Nuclear receptor subfamily 3 group C member 2
Type:
Enzyme
Mol. Mass.:
107076.42
Organism:
Homo sapiens (Human)
Description:
P08235
Residue:
984
  
Inhibitor
Name:
BDBM50398059
Synonyms:
CHEMBL2181932
Type:
Small organic molecule
Emp. Form.:
C22H21F3N2O4S
Mol. Mass.:
466.473
SMILES:
Cc1c(cn(CCO)c1-c1ccccc1C(F)(F)F)C(=O)Nc1ccc(cc1)S(C)(=O)=O
: