Target
Mineralocorticoid receptor
Ligand
BDBM50235961
Substrate
Meas. Tech.
ChEMBL_1658424 (CHEMBL4008036)
IC50
1.3±n/a nM
Citation
 Martín-Martínez, MPérez-Gordillo, FLÁlvarez de la Rosa, DRodríguez, YGerona-Navarro, GGonzález-Muñiz, RZhou, MM Modulating Mineralocorticoid Receptor with Non-steroidal Antagonists. New Opportunities for the Development of Potent and Selective Ligands without Off-Target Side Effects. J Med Chem 60:2629-2650 (2017)  
Target
Name:
Mineralocorticoid receptor
Synonyms:
MCR MLR NR3C2 | Nuclear receptor subfamily 3 group C member 2
Type:
Enzyme
Mol. Mass.:
107076.42
Organism:
Homo sapiens (Human)
Description:
P08235
Residue:
984
  
Inhibitor
Name:
BDBM50235961
Synonyms:
CHEMBL4102708
Type:
Small organic molecule
Emp. Form.:
C20H21NO4
Mol. Mass.:
339.385
SMILES:
CC(=O)Oc1ccc(CCc2cc(C)c3OCC(=O)Nc3c2)c(C)c1
: