Target
Mineralocorticoid receptor
Ligand
BDBM50235945
Substrate
Meas. Tech.
ChEMBL_1658407 (CHEMBL4008019)
IC50
6.50±n/a nM
Citation
 Martín-Martínez, MPérez-Gordillo, FLÁlvarez de la Rosa, DRodríguez, YGerona-Navarro, GGonzález-Muñiz, RZhou, MM Modulating Mineralocorticoid Receptor with Non-steroidal Antagonists. New Opportunities for the Development of Potent and Selective Ligands without Off-Target Side Effects. J Med Chem 60:2629-2650 (2017)  
Target
Name:
Mineralocorticoid receptor
Synonyms:
MCR MLR NR3C2 | Nuclear receptor subfamily 3 group C member 2
Type:
Enzyme
Mol. Mass.:
107076.42
Organism:
Homo sapiens (Human)
Description:
P08235
Residue:
984
  
Inhibitor
Name:
BDBM50235945
Synonyms:
CHEMBL4068898
Type:
Small organic molecule
Emp. Form.:
C22H20F4N2O4S
Mol. Mass.:
484.464
SMILES:
Cc1c(cc(CCF)n1-c1ccc(F)cc1OC(F)F)C(=O)Nc1ccc(cc1)S(C)(=O)=O
: