Target
Mineralocorticoid receptor
Ligand
BDBM50235965
Substrate
Meas. Tech.
ChEMBL_1658407 (CHEMBL4008019)
IC50
6.2±n/a nM
Citation
 Martín-Martínez, MPérez-Gordillo, FLÁlvarez de la Rosa, DRodríguez, YGerona-Navarro, GGonzález-Muñiz, RZhou, MM Modulating Mineralocorticoid Receptor with Non-steroidal Antagonists. New Opportunities for the Development of Potent and Selective Ligands without Off-Target Side Effects. J Med Chem 60:2629-2650 (2017)  
Target
Name:
Mineralocorticoid receptor
Synonyms:
MCR MLR NR3C2 | Nuclear receptor subfamily 3 group C member 2
Type:
Enzyme
Mol. Mass.:
107076.42
Organism:
Homo sapiens (Human)
Description:
P08235
Residue:
984
  
Inhibitor
Name:
BDBM50235965
Synonyms:
CHEMBL4088459
Type:
Small organic molecule
Emp. Form.:
C24H24F4N2O4S
Mol. Mass.:
512.517
SMILES:
C[C@H](O)[C@@H](C)c1cc(C(=O)Nc2ccc(cc2)S(C)(=O)=O)c(C)n1-c1ccc(F)cc1C(F)(F)F
: