Target
Mineralocorticoid receptor
Ligand
BDBM50398061
Substrate
Meas. Tech.
ChEMBL_1658425 (CHEMBL4008037)
IC50
44±n/a nM
Citation
 Martín-Martínez, MPérez-Gordillo, FLÁlvarez de la Rosa, DRodríguez, YGerona-Navarro, GGonzález-Muñiz, RZhou, MM Modulating Mineralocorticoid Receptor with Non-steroidal Antagonists. New Opportunities for the Development of Potent and Selective Ligands without Off-Target Side Effects. J Med Chem 60:2629-2650 (2017)  
Target
Name:
Mineralocorticoid receptor
Synonyms:
MCR MLR NR3C2 | Nuclear receptor subfamily 3 group C member 2
Type:
Enzyme
Mol. Mass.:
107076.42
Organism:
Homo sapiens (Human)
Description:
P08235
Residue:
984
  
Inhibitor
Name:
BDBM50398061
Synonyms:
CHEMBL2181928
Type:
Small organic molecule
Emp. Form.:
C18H19N3O3
Mol. Mass.:
325.3618
SMILES:
C[C@@H]1CN([C@@H](CO1)c1ccccc1)c1ccc2OCC(=O)Nc2n1
: