Target
Mineralocorticoid receptor
Ligand
BDBM50235968
Substrate
Meas. Tech.
ChEMBL_1658425 (CHEMBL4008037)
IC50
54±n/a nM
Citation
 Martín-Martínez, MPérez-Gordillo, FLÁlvarez de la Rosa, DRodríguez, YGerona-Navarro, GGonzález-Muñiz, RZhou, MM Modulating Mineralocorticoid Receptor with Non-steroidal Antagonists. New Opportunities for the Development of Potent and Selective Ligands without Off-Target Side Effects. J Med Chem 60:2629-2650 (2017)  
Target
Name:
Mineralocorticoid receptor
Synonyms:
MCR MLR NR3C2 | Nuclear receptor subfamily 3 group C member 2
Type:
Enzyme
Mol. Mass.:
107076.42
Organism:
Homo sapiens (Human)
Description:
P08235
Residue:
984
  
Inhibitor
Name:
BDBM50235968
Synonyms:
CHEMBL4069468
Type:
Small organic molecule
Emp. Form.:
C18H18FN3O3
Mol. Mass.:
343.3522
SMILES:
C[C@@H]1CN([C@@H](CO1)c1ccccc1F)c1cc2NC(=O)COc2cn1
: