Target
Mineralocorticoid receptor
Ligand
BDBM50235970
Substrate
Meas. Tech.
ChEMBL_1658411 (CHEMBL4008023)
IC50
18±n/a nM
Citation
 Martín-Martínez, MPérez-Gordillo, FLÁlvarez de la Rosa, DRodríguez, YGerona-Navarro, GGonzález-Muñiz, RZhou, MM Modulating Mineralocorticoid Receptor with Non-steroidal Antagonists. New Opportunities for the Development of Potent and Selective Ligands without Off-Target Side Effects. J Med Chem 60:2629-2650 (2017)  
Target
Name:
Mineralocorticoid receptor
Synonyms:
MCR MLR NR3C2 | Nuclear receptor subfamily 3 group C member 2
Type:
Enzyme
Mol. Mass.:
107076.42
Organism:
Homo sapiens (Human)
Description:
P08235
Residue:
984
  
Inhibitor
Name:
BDBM50235970
Synonyms:
CHEMBL4094464
Type:
Small organic molecule
Emp. Form.:
C25H25NO5
Mol. Mass.:
419.4697
SMILES:
COC(=O)c1c(C)nc(C)c(C(=O)CC2CCC2)c1-c1cccc2c1oc(C)cc2=O
: