Target
5-hydroxytryptamine receptor 2A
Ligand
BDBM50005251
Substrate
Meas. Tech.
ChEMBL_1660342 (CHEMBL4009954)
Ki
5200±n/a nM
Citation
 Glennon, RA The 2014 Philip S. Portoghese Medicinal Chemistry Lectureship: The"Phenylalkylaminome" with a Focus on Selected Drugs of Abuse. J Med Chem 60:2605-2628 (2017)  
Target
Name:
5-hydroxytryptamine receptor 2A
Synonyms:
5-HT-2A 5-HT2A 5-hydroxytryptamine receptor 2A (5HT2A) Htr2 Serotonin Receptor 2A
Type:
G Protein-Coupled Receptor (GPCR)
Mol. Mass.:
52852.05
Organism:
Rattus norvegicus (rat)
Description:
Rat cortex membranes 5-HT2A receptors.
Residue:
471
  
Inhibitor
Name:
BDBM50005251
Synonyms:
(+/-)2-(2,5-Dimethoxy-phenyl)-1-methyl-ethylamine 2,5-dimethoxy-4-bromoamphetamine 2-(2,5-Dimethoxy-phenyl)-1-methyl-ethylamine(2,5-DMA) DMA
Type:
Small organic molecule
Emp. Form.:
C11H17NO2
Mol. Mass.:
195.2582
SMILES:
COc1ccc(OC)c(CC(C)N)c1
: