Target
D(3) dopamine receptor
Ligand
BDBM50237166
Substrate
Meas. Tech.
ChEBML_1660549
Ki
0.710000±n/a nM
Citation
 Möller, DBanerjee, AUzuneser, TCSkultety, MHuth, TPlouffe, BHübner, HAlzheimer, CFriedland, KMüller, CPBouvier, MGmeiner, P Discovery of G Protein-Biased Dopaminergics with a Pyrazolo[1,5-a]pyridine Substructure. J Med Chem 60:2908-2929 (2017)  
Target
Name:
D(3) dopamine receptor
Synonyms:
DOPAMINE D3 DRD3_HUMAN Dopamine D3 receptor (D3) Dopamine receptor Dopamine receptor D3
Type:
Mol. Mass.:
44243.43
Organism:
Homo sapiens (Human)
Description:
Residue:
400
  
Inhibitor
Name:
BDBM50237166
Synonyms:
CHEMBL4097330
Type:
Small organic molecule
Emp. Form.:
C24H31N3O2
Mol. Mass.:
393.5218
SMILES:
CCCN(CCCCOc1ccc2ccnn2c1)[C@H]1CCc2c(O)cccc2C1
: