Target
D(4) dopamine receptor
Ligand
BDBM50237166
Substrate
Meas. Tech.
ChEBML_1660540
Ki
1.5±n/a nM
Citation
 Möller, DBanerjee, AUzuneser, TCSkultety, MHuth, TPlouffe, BHübner, HAlzheimer, CFriedland, KMüller, CPBouvier, MGmeiner, P Discovery of G Protein-Biased Dopaminergics with a Pyrazolo[1,5-a]pyridine Substructure. J Med Chem 60:2908-2929 (2017)  
Target
Name:
D(4) dopamine receptor
Synonyms:
D(2C) dopamine receptor DOPAMINE D4.2 DRD4 Dopamine D4 receptor
Type:
Enzyme
Mol. Mass.:
48373.19
Organism:
Homo sapiens (Human)
Description:
P21917
Residue:
419
  
Inhibitor
Name:
BDBM50237166
Synonyms:
CHEMBL4097330
Type:
Small organic molecule
Emp. Form.:
C24H31N3O2
Mol. Mass.:
393.5218
SMILES:
CCCN(CCCCOc1ccc2ccnn2c1)[C@H]1CCc2c(O)cccc2C1
: