Target
Mu-type opioid receptor
Ligand
BDBM50236872
Substrate
Meas. Tech.
ChEBML_1659530
Ki
1230±n/a nM
Citation
 Soeberdt, MMolenveld, PStorcken, RPBouzanne des Mazery, RSterk, GJAutar, RBolster, MGWagner, CAerts, SNvan Holst, FRWegert, ATangherlini, GFrehland, BSchepmann, DMetze, DLotts, TKnie, ULin, KYHuang, TYLai, CCStänder, SWünsch, BAbels, C Design and Synthesis of Enantiomerically Pure Decahydroquinoxalines as Potent and Selective¿-Opioid Receptor Agonists with Anti-Inflammatory Activity in Vivo. J Med Chem 60:2526-2551 (2017)  
Target
Name:
Mu-type opioid receptor
Synonyms:
M-OR-1 Mu opioid receptor OPIATE Mu OPRM_CAVPO
Type:
Enzyme Catalytic Domain
Mol. Mass.:
11165.58
Organism:
GUINEA PIG
Description:
P97266
Residue:
98
  
Inhibitor
Name:
BDBM50236872
Synonyms:
CHEMBL4072972
Type:
Small organic molecule
Emp. Form.:
C23H31Cl2N3O3
Mol. Mass.:
468.417
SMILES:
[H][C@]12CCC[C@H](N3CCCC3)[C@@]1([H])N(CCN2CC(=O)OC)C(=O)Cc1ccc(Cl)c(Cl)c1
: