Target
Kappa-type opioid receptor
Ligand
BDBM50236870
Substrate
Meas. Tech.
ChEBML_1659529
Ki
0.270000±n/a nM
Citation
 Soeberdt, MMolenveld, PStorcken, RPBouzanne des Mazery, RSterk, GJAutar, RBolster, MGWagner, CAerts, SNvan Holst, FRWegert, ATangherlini, GFrehland, BSchepmann, DMetze, DLotts, TKnie, ULin, KYHuang, TYLai, CCStänder, SWünsch, BAbels, C Design and Synthesis of Enantiomerically Pure Decahydroquinoxalines as Potent and Selective¿-Opioid Receptor Agonists with Anti-Inflammatory Activity in Vivo. J Med Chem 60:2526-2551 (2017)  
Target
Name:
Kappa-type opioid receptor
Synonyms:
Kappa Opioid Receptor OPRK1 Opiate Kappa 1 | mu/kappa opioid receptor
Type:
G Protein-Coupled Receptor (GPCR)
Mol. Mass.:
42744.99
Organism:
Cavia porcellus (domestic guinea pig)
Description:
P41144
Residue:
380
  
Inhibitor
Name:
BDBM50236870
Synonyms:
CHEMBL4064380
Type:
Small organic molecule
Emp. Form.:
C23H29ClF3N3O4
Mol. Mass.:
503.942
SMILES:
[H][C@]12CCC[C@H](N3CC[C@H](O)C3)[C@@]1([H])N(CCN2C(=O)OC)C(=O)Cc1ccc(c(Cl)c1)C(F)(F)F
: