Target
Kappa-type opioid receptor
Ligand
BDBM50236886
Substrate
Meas. Tech.
ChEMBL_1659529 (CHEMBL4009141)
Ki
0.430000±n/a nM
Citation
 Soeberdt, MMolenveld, PStorcken, RPBouzanne des Mazery, RSterk, GJAutar, RBolster, MGWagner, CAerts, SNvan Holst, FRWegert, ATangherlini, GFrehland, BSchepmann, DMetze, DLotts, TKnie, ULin, KYHuang, TYLai, CCStänder, SWünsch, BAbels, C Design and Synthesis of Enantiomerically Pure Decahydroquinoxalines as Potent and Selective¿-Opioid Receptor Agonists with Anti-Inflammatory Activity in Vivo. J Med Chem 60:2526-2551 (2017)  
Target
Name:
Kappa-type opioid receptor
Synonyms:
Kappa Opioid Receptor OPRK1 Opiate Kappa 1 | mu/kappa opioid receptor
Type:
G Protein-Coupled Receptor (GPCR)
Mol. Mass.:
42744.99
Organism:
Cavia porcellus (domestic guinea pig)
Description:
P41144
Residue:
380
  
Inhibitor
Name:
BDBM50236886
Synonyms:
CHEMBL4099849
Type:
Small organic molecule
Emp. Form.:
C24H33Cl2N3O3
Mol. Mass.:
482.443
SMILES:
[H][C@]12CCC[C@H](N3CCCC3)[C@@]1([H])N(CCN2CC(=O)OCC)C(=O)Cc1ccc(Cl)c(Cl)c1
: