Target
Kappa-type opioid receptor
Ligand
BDBM50236884
Substrate
Meas. Tech.
ChEMBL_1659529 (CHEMBL4009141)
Ki
1.7±n/a nM
Citation
 Soeberdt, MMolenveld, PStorcken, RPBouzanne des Mazery, RSterk, GJAutar, RBolster, MGWagner, CAerts, SNvan Holst, FRWegert, ATangherlini, GFrehland, BSchepmann, DMetze, DLotts, TKnie, ULin, KYHuang, TYLai, CCStänder, SWünsch, BAbels, C Design and Synthesis of Enantiomerically Pure Decahydroquinoxalines as Potent and Selective¿-Opioid Receptor Agonists with Anti-Inflammatory Activity in Vivo. J Med Chem 60:2526-2551 (2017)  
Target
Name:
Kappa-type opioid receptor
Synonyms:
Kappa Opioid Receptor OPRK1 Opiate Kappa 1 | mu/kappa opioid receptor
Type:
G Protein-Coupled Receptor (GPCR)
Mol. Mass.:
42744.99
Organism:
Cavia porcellus (domestic guinea pig)
Description:
P41144
Residue:
380
  
Inhibitor
Name:
BDBM50236884
Synonyms:
CHEMBL4060558
Type:
Small organic molecule
Emp. Form.:
C21H29ClFN3O4S
Mol. Mass.:
473.989
SMILES:
[H][C@]12CCC[C@H](N3CC[C@H](O)C3)[C@@]1([H])N(CCN2S(C)(=O)=O)C(=O)Cc1ccc(F)c(Cl)c1
: