Target
Kappa-type opioid receptor
Ligand
BDBM50236867
Substrate
Meas. Tech.
ChEMBL_1659529 (CHEMBL4009141)
Ki
1.8±n/a nM
Citation
 Soeberdt, MMolenveld, PStorcken, RPBouzanne des Mazery, RSterk, GJAutar, RBolster, MGWagner, CAerts, SNvan Holst, FRWegert, ATangherlini, GFrehland, BSchepmann, DMetze, DLotts, TKnie, ULin, KYHuang, TYLai, CCStänder, SWünsch, BAbels, C Design and Synthesis of Enantiomerically Pure Decahydroquinoxalines as Potent and Selective¿-Opioid Receptor Agonists with Anti-Inflammatory Activity in Vivo. J Med Chem 60:2526-2551 (2017)  
Target
Name:
Kappa-type opioid receptor
Synonyms:
Kappa Opioid Receptor OPRK1 Opiate Kappa 1 | mu/kappa opioid receptor
Type:
G Protein-Coupled Receptor (GPCR)
Mol. Mass.:
42744.99
Organism:
Cavia porcellus (domestic guinea pig)
Description:
P41144
Residue:
380
  
Inhibitor
Name:
BDBM50236867
Synonyms:
CHEMBL4083401
Type:
Small organic molecule
Emp. Form.:
C22H29ClFN3O4
Mol. Mass.:
453.935
SMILES:
[H][C@]12CCC[C@H](N3CC[C@H](O)C3)[C@@]1([H])N(CCN2C(=O)OC)C(=O)Cc1ccc(Cl)c(F)c1
: