Target
Aldehyde dehydrogenase, mitochondrial
Ligand
BDBM50236899
Substrate
Meas. Tech.
ChEMBL_1659722 (CHEMBL4009334)
IC50
110±n/a nM
Citation
 Buchman, CDHurley, TD Inhibition of the Aldehyde Dehydrogenase 1/2 Family by Psoralen and Coumarin Derivatives. J Med Chem 60:2439-2455 (2017)  
Target
Name:
Aldehyde dehydrogenase, mitochondrial
Synonyms:
ALDH class 2 ALDH2 ALDHI Aldehyde dehydrogenase (ALDH2)
Type:
Enzyme
Mol. Mass.:
56382.67
Organism:
Homo sapiens (Human)
Description:
P05091
Residue:
517
  
Inhibitor
Name:
BDBM50236899
Synonyms:
CHEMBL4099822
Type:
Small organic molecule
Emp. Form.:
C17H18O3
Mol. Mass.:
270.323
SMILES:
CCCc1c(C)c2cc3c(C)c(C)oc3cc2oc1=O
: