Target
Aldehyde dehydrogenase family 1 member A3
Ligand
BDBM50409029
Substrate
Meas. Tech.
ChEMBL_1659729 (CHEMBL4009341)
IC50
>200000±n/a nM
Citation
 Buchman, CDHurley, TD Inhibition of the Aldehyde Dehydrogenase 1/2 Family by Psoralen and Coumarin Derivatives. J Med Chem 60:2439-2455 (2017)  
Target
Name:
Aldehyde dehydrogenase family 1 member A3
Synonyms:
AL1A3_HUMAN ALDH6 Aldehyde dehydrogenase family 1 member A3 RalDH3 | Retinaldehyde dehydrogenase 3
Type:
PROTEIN
Mol. Mass.:
56110.85
Organism:
Homo sapiens (Human)
Description:
ChEMBL_109700
Residue:
512
  
Inhibitor
Name:
BDBM50409029
Synonyms:
DAIDZIN
Type:
Small organic molecule
Emp. Form.:
C21H20O9
Mol. Mass.:
416.3781
SMILES:
OC[C@H]1O[C@@H](Oc2ccc3c(c2)occ(-c2ccc(O)cc2)c3=O)[C@H](O)[C@@H](O)[C@@H]1O
: