Target
Procathepsin L
Ligand
BDBM50237029
Substrate
Meas. Tech.
ChEMBL_1661378 (CHEMBL4010990)
Ki
515±n/a nM
Citation
 Kuhn, BTichư, MWang, LRobinson, SMartin, REKuglstatter, ABenz, JGiroud, MSchirmeister, TAbel, RDiederich, FHert, J Prospective Evaluation of Free Energy Calculations for the Prioritization of Cathepsin L Inhibitors. J Med Chem 60:2485-2497 (2017)  
Target
Name:
Procathepsin L
Synonyms:
CATL1_HUMAN CTSL CTSL1 Cathepsin L Cathepsin L1 heavy chain MEP cathepsin L preproprotein
Type:
Enzyme
Mol. Mass.:
37557.19
Organism:
Homo sapiens (Human)
Description:
Purchased from Calbiochem (San Diego, CA).
Residue:
333
  
Inhibitor
Name:
BDBM50237029
Synonyms:
CHEMBL4097098
Type:
Small organic molecule
Emp. Form.:
C18H17FN4O2S
Mol. Mass.:
372.417
SMILES:
Fc1cnc(nc1N(Cc1ccc2OCOc2c1)C1CCSCC1)C#N
: