Target
Procathepsin L
Ligand
BDBM50237033
Substrate
Meas. Tech.
ChEMBL_1661378 (CHEMBL4010990)
Ki
3020±n/a nM
Citation
 Kuhn, BTichư, MWang, LRobinson, SMartin, REKuglstatter, ABenz, JGiroud, MSchirmeister, TAbel, RDiederich, FHert, J Prospective Evaluation of Free Energy Calculations for the Prioritization of Cathepsin L Inhibitors. J Med Chem 60:2485-2497 (2017)  
Target
Name:
Procathepsin L
Synonyms:
CATL1_HUMAN CTSL CTSL1 Cathepsin L Cathepsin L1 heavy chain MEP cathepsin L preproprotein
Type:
Enzyme
Mol. Mass.:
37557.19
Organism:
Homo sapiens (Human)
Description:
Purchased from Calbiochem (San Diego, CA).
Residue:
333
  
Inhibitor
Name:
BDBM50237033
Synonyms:
CHEMBL4083435
Type:
Small organic molecule
Emp. Form.:
C22H25FN4O2
Mol. Mass.:
396.4579
SMILES:
CC(C)[C@H]1CC[C@H](CC1)N(Cc1ccc2OCOc2c1)c1nc(ncc1F)C#N
: