Target
Potassium voltage-gated channel subfamily A member 4
Ligand
BDBM50237157
Substrate
Meas. Tech.
ChEBML_1659964
IC50
21000±n/a nM
Citation
 Al-Sabi, ADaly, DHoefer, PKinsella, GKMetais, CPickering, MHerron, CKaza, SKNolan, KDolly, JO A Rational Design of a Selective Inhibitor for Kv1.1 Channels Prevalent in Demyelinated Nerves That Improves Their Impaired Axonal Conduction. J Med Chem 60:2245-2256 (2017)  
Target
Name:
Potassium voltage-gated channel subfamily A member 4
Synonyms:
KCNA4 KCNA4_HUMAN Voltage-gated potassium channel subunit Kv1.4
Type:
PROTEIN
Mol. Mass.:
73234.81
Organism:
Homo sapiens (Human)
Description:
ChEMBL_471773
Residue:
653
  
Inhibitor
Name:
BDBM50237157
Synonyms:
CHEMBL4079366
Type:
Small organic molecule
Emp. Form.:
C29H36Cl2N6O2
Mol. Mass.:
571.541
SMILES:
Cl.Cl.Cc1ccc(cc1)C(c1ccc([nH]1)C(=O)NCCN)(c1ccc([nH]1)C(=O)NCCN)c1ccc(C)cc1
: